Langues
type: ConceptScheme
has top concept: tchèque

tchèque
type: Concept
created: 2016-01-01T00:00:00Z
status: CURRENT
in scheme: Langues
top concept of: Langues
deprecated: false @en
notation: ces
notation: cs
definition: Le tchèque est une langue du sous-groupe occidental des langues slaves, parlée principalement en République tchèque. Le tchèque est une des langues les plus flexionnelles dans le monde.