Langues
type: ConceptScheme
has top concept: bulgare

bulgare
type: Concept
created: 2016-01-01T00:00:00Z
status: CURRENT
in scheme: Langues
top concept of: Langues
deprecated: false @en
notation: bg
notation: bul
definition: Le bulgare est une langue du sous-groupe sud des langues slaves. Il est parlé principalement en Bulgarie. Le bulgare a plusieurs caractéristiques qui le distinguent de toutes les autres langues slaves, par exemple l’absence de déclinaison ou l’existence d’un article défini suffixé au nom. Il est écrit avec l’alphabet cyrillique.