Langues
type: ConceptScheme
has top concept: breton

breton
type: Concept
created: 2016-01-01T00:00:00Z
status: CURRENT
in scheme: Langues
top concept of: Langues
deprecated: false @en
notation: br
notation: bre
definition: Le breton est une langue du sous-groupe brittonique des langues celtiques, parlée en Bretagne, dans l’ouest de la France. Il est très proche du cornique. Le breton est reconnu comme langue régionale ou minoritaire de France et comme langue de la région de la Bretagne. Il est classé comme «langue sérieusement en danger» selon l’Unesco.