Langues
type: ConceptScheme
has top concept: bosnien

bosnien
type: Concept
created: 2016-01-01T00:00:00Z
status: CURRENT
in scheme: Langues
top concept of: Langues
deprecated: false @en
notation: bs
notation: bos
definition: Le bosnien, parfois appelé «bosniaque», est une langue indo-européenne de la branche des langues slaves, groupe méridional de ces langues; il a pour base le dialecte chtokavien de l’entité linguistique appelée «langue serbo-croate». Le bosnien est écrit avec l’alphabet latin mais aussi avec l’alphabet cyrillique.