Langues
type: ConceptScheme
has top concept: biélorusse

biélorusse
type: Concept
created: 2016-01-01T00:00:00Z
status: CURRENT
in scheme: Langues
top concept of: Langues
deprecated: false @en
notation: be
notation: bel
definition: Le biélorusse fait partie de la famille des langues slaves et partage de nombreuses caractéristiques grammaticales et lexicales avec d’autres langues de cette famille, le russe et l’ukrainien. Il est parlé principalement en Biélorussie. Le biélorusse s’écrit avec l’alphabet cyrillique.