Langues
type: ConceptScheme
has top concept: valencien

valencien
type: Concept
created: 2016-01-01T00:00:00Z
status: CURRENT
in scheme: Langues
top concept of: Langues
deprecated: false @en
definition: Le valencien est un dialecte catalan parlé dans la Communauté de Valence en Espagne. L’Académie valencienne de la langue considère simplement le catalan et le valencien comme deux noms pour la même langue.