Langues
type: ConceptScheme
has top concept: vietnamien

vietnamien
type: Concept
status: CURRENT
created: 2016-01-01T00:00:00Z
deprecated: false @en
definition: Le vietnamien appartient à la branche môn-khmère des langues austro-asiatiques. Il est la langue austro-asiatique qui possède le plus de locuteurs. C’est une langue isolante et monosyllabique, dotée d’un système de 6 tons. Dans l’écriture latinisée utilisée actuellement, le Quốc ngữ, les mots figurent comme une succession de monosyllabes.
in scheme: Langues
notation: vie
notation: vi
top concept of: Langues