Langues
type: ConceptScheme
has top concept: ourdou

ourdou
type: Concept
status: CURRENT
created: 2016-01-01T00:00:00Z
deprecated: false @en
definition: L’ourdou ou urdu est une langue appartenant au groupe indo-iranien de la famille des langues indo-européennes. En Inde, il est connu sous le nom de «hindi» et s’écrit en caractères sanskrits, mais ses locuteurs musulmans le nomment «ourdou» et l’écrivent en caractères arabes, comme au Pakistan.
in scheme: Langues
notation: ur
notation: urd
top concept of: Langues