Langues
type: ConceptScheme
has top concept: ukrainien

ukrainien
type: Concept
status: CURRENT
created: 2016-01-01T00:00:00Z
deprecated: false @en
definition: L’ukrainien fait partie des langues slaves et partage de nombreuses caractéristiques grammaticales et lexicales avec d’autres langues de cette branche, le russe et le biélorusse. Il est parlé principalement en Ukraine. L’ukrainien s’écrit avec l’alphabet cyrillique.
in scheme: Langues
notation: uk
notation: ukr
top concept of: Langues