Langues
type: ConceptScheme
has top concept: turkmène

turkmène
type: Concept
status: CURRENT
created: 2016-01-01T00:00:00Z
deprecated: false @en
definition: Le turkmène est une langue appartenant au groupe des langues turques, parlée en Asie centrale, principalement au Turkménistan. Le turkmène a été écrit avec un alphabet arabe adapté, puis un alphabet latin jusqu’en 1940. L’État soviétique force alors l’adoption d’une variante de l’alphabet cyrillique pour l’écriture du turkmène. Depuis 1997, l’alphabet officiel est une variante de l’alphabet latin avec quelques diacritiques, proche de celui du turc.
in scheme: Langues
notation: tk
notation: tuk
top concept of: Langues