Langues
type: ConceptScheme
has top concept: russe

russe
type: Concept
status: CURRENT
created: 2016-01-01T00:00:00Z
deprecated: false @en
definition: Le russe est une langue slave orientale et est proche de l’ukrainien et du biélorusse. Le russe est une langue officielle ou non mais parlée dans certains pays qui étaient auparavant des républiques de l’Union soviétique. C’est la langue de l’Eurasie la plus étendue géographiquement et la langue slave la plus parlée. Le russe est écrit avec l’alphabet cyrillique.
in scheme: Langues
notation: ru
notation: rus
top concept of: Langues