Langues
type: ConceptScheme
has top concept: latin

latin
type: Concept
status: CURRENT
created: 2016-01-01T00:00:00Z
deprecated: false @en
definition: Le latin est une langue indo-européenne, souvent considérée comme une langue morte, qui a été parlée dans la Rome antique et son empire. Les langues romanes modernes sont des continuations des formes dialectales (latin vulgaire) de la langue. De nombreux étudiants, des chercheurs et des membres du clergé chrétien parlent encore couramment le latin, et il est toujours enseigné dans certains établissements d’enseignement à travers le monde. Le latin est encore utilisé dans la création de nouveaux mots dans les langues modernes de nombreuses familles, en particulier dans la taxonomie biologique.
in scheme: Langues
notation: la
notation: lat
top concept of: Langues