Langues
type: ConceptScheme
has top concept: kurde

kurde
type: Concept
status: CURRENT
created: 2016-01-01T00:00:00Z
deprecated: false @en
definition: Le kurde est une langue appartenant au sous-groupe iranien des langues indo-européennes, parlée par le peuple kurde en Iran, en Iraq, en Turquie et en Syrie. Le terme «langues kurdes» est également utilisé à la place de «langue kurde», parce que les dialectes ne sont pas mutuellement intelligibles sans bilinguisme acquis et les langues parlées par les Kurdes ne forment pas un groupe linguistique. Le principal dialecte du Nord, Kurmanjo, est écrit avec l’alphabet latin, tandis que d’autres utilisent l’alphabet arabe.
in scheme: Langues
notation: ku
notation: kur
top concept of: Langues