Langues
type: ConceptScheme
has top concept: hindi créole des îles Andaman

hindi créole des îles Andaman
type: Concept
status: CURRENT
created: 2016-01-01T00:00:00Z
deprecated: false @en
definition: Andaman Creole Hindi is a trade language of the Andaman Islands, spoken as a native language especially in Port Blair and villages to the south. It is described as a creolization of Hindustani, Bengali, and Malayalam.
in scheme: Langues
notation: hca
top concept of: Langues