Langues
type: ConceptScheme
has top concept: créole haïtien

créole haïtien
type: Concept
status: CURRENT
created: 2016-01-01T00:00:00Z
deprecated: false @en
definition: Haitian is a French-based creole language. It is one of the official languages of Haiti.
in scheme: Langues
notation: ht
notation: hat
top concept of: Langues