Langues
type: ConceptScheme
has top concept: espéranto

espéranto
type: Concept
status: CURRENT
created: 2016-01-01T00:00:00Z
deprecated: false @en
definition: L’espéranto est la langue auxiliaire construite internationale la plus parlée. Son nom dérive de «Doktoro Esperanto» («espéranto» se traduit par «celui qui espère»), le pseudonyme sous lequel Ludwig Zamenhof a publié le premier livre détaillant l’espéranto, en 1887. Cette langue artificielle a des bases indo-européennes, à la fois dans son lexique et dans les catégories grammaticales avec lesquels elle opère.
in scheme: Langues
notation: eo
notation: epo
top concept of: Langues