Langues
type: ConceptScheme
has top concept: gallois

gallois
type: Concept
status: CURRENT
created: 2016-01-01T00:00:00Z
deprecated: false @en
definition: Le gallois est une langue du sous-groupe brittonique des langues celtiques, parlée principalement au pays de Galles. Il a le statut de langue officielle au pays de Galles. Le gallois littéraire moderne standard est une forme conservatrice de la langue: cela le rend plus difficile à apprendre, mais ceux qui savent le lire peuvent également lire les premiers classiques.
in scheme: Langues
notation: cy
notation: cym
top concept of: Langues