Langues
type: ConceptScheme
has top concept: azéri

azéri
type: Concept
status: CURRENT
created: 2016-01-01T00:00:00Z
deprecated: false @en
definition: L’azéri ou azerbaïdjanais est une langue appartenant au groupe oghuz des langues turques, parlée principalement dans la région du Caucase. L’azéri et le turc sont assez similaires. L’azéri a été écrit dans l’alphabet arabo-persan, un alphabet latin modifié et avec une forme de l’alphabet cyrillique. Après la chute de l’Union soviétique, l’écriture latine est introduite.
in scheme: Langues
notation: aze
notation: az
top concept of: Langues