Langues
type: ConceptScheme
has top concept: arabe

arabe
type: Concept
status: CURRENT
created: 2016-01-01T00:00:00Z
deprecated: false @en
definition: Parlée d’abord par les Arabes, cette langue sémitique qui se déploie géographiquement sur plusieurs continents s’étend sociologiquement à des peuples non arabes et est aujourd’hui la langue officielle de plusieurs organismes internationaux. L’arabe est aussi une des six langues officielles de l’Organisation des Nations unies. La diglossie est un caractère de la langue arabe, qui permet de distinguer l’arabe vernaculaire de l’arabe littéraire. Le niveau de langue littéraire comprend l’arabe classique (pré-coranique, coranique et post-coranique) et l’arabe standard moderne. Le niveau de langue vernaculaire comprend toutes les variantes des dialectes arabes régionaux. L’arabe utilise l’écriture arabe.
in scheme: Langues
notation: ar
notation: ara
top concept of: Langues