Langues
type: ConceptScheme
has top concept: valencien

valencien
type: Concept
status: CURRENT
created: 2016-01-01T00:00:00Z
deprecated: false @en
definition: Le valencien est un dialecte catalan parlé dans la Communauté de Valence en Espagne. L’Académie valencienne de la langue considère simplement le catalan et le valencien comme deux noms pour la même langue.
in scheme: Langues
top concept of: Langues